Reaction Details
TargetAlpha-1D adrenergic receptor
LigandBDBM50219131
Substrate/Competitorn/a
Meas. Tech.ChEMBL_30101 (CHEMBL642028)
EC50 79±n/a nM
Citation Bishop, MJBerman, JBigham, ECGarrison, DTGobel, MJHodson, SJIrving, PELiacos, JAMinick, DJNavas, FSaussy, DLSpeake, JD 2-(Anilinomethyl)imidazolines as alpha(1)-adrenoceptor agonists: the identification of alpha(1A) subtype selective 2'-carboxylic acid esters and amides. Bioorg Med Chem Lett11:2871-4 (2001) Alpha-1D adrenergic receptor
Name:Alpha-1D adrenergic receptor
Type:Enzyme Catalytic Domain
Mol. Mass.:60485.82
Organism:Homo sapiens (Human)
Description:adrenergic Alpha1D ADRA1D HUMAN::P25100
Residue:572
BDBM50219131
NameBDBM50219131
Synonyms:CHEMBL99362
TypeSmall organic molecule
Emp. Form.C13H18N4O
Mol. Mass.246.3082
SMILESCCNC(=O)c1ccccc1NCC1=NCCN1