Reaction Details
TargetSubstance-P receptor
LigandBDBM50421552
Substrate/Competitorn/a
Meas. Tech.ChEBML_205889
IC50 1.00±n/a nM
Citation Ryckmans, TBerton, OGrimée, RKogej, TLamberty, YPasau, PTalaga, PGenicot, C Dual NK(1) antagonists--serotonin reuptake inhibitors as potential antidepressants. Part 2: SAR and activity of benzyloxyphenethyl piperazine derivatives. Bioorg Med Chem Lett12:3195-8 (2002) Substance-P receptor
Name:Substance-P receptor
Type:G Protein-Coupled Receptor (GPCR)
Mol. Mass.:46254.43
Organism:Homo sapiens (Human)
Description:P25103
Residue:407
BDBM50421552
NameBDBM50421552
Synonyms:CHEMBL108200
TypeSmall organic molecule
Emp. Form.C22H24F6N2O2
Mol. Mass.462.4286
SMILESCOc1cccc(c1)C(COCc1cc(cc(c1)C(F)(F)F)C(F)(F)F)N1CCNCC1