Reaction Details
TargetAlpha-1A adrenergic receptor
LigandBDBM50421576
Substrate/Competitorn/a
Meas. Tech.ChEMBL_32510 (CHEMBL641225)
EC50 4±n/a nM
Citation Hodson, SJBigham, ECGarrison, DTGobel, MJIrving, PELiacos, JANavas, FSaussy, DLSherman, BWSpeake, JDBishop, MJ Alpha(1)-adrenoceptor activation: a comparison of 4-(anilinomethyl)imidazoles and 4-(phenoxymethyl)imidazoles to related 2-imidazolines. Bioorg Med Chem Lett12:3449-52 (2002) Alpha-1A adrenergic receptor
Name:Alpha-1A adrenergic receptor
Type:Cell-surface receptors
Mol. Mass.:51511.67
Organism:Homo sapiens (Human)
Description:P35348
Residue:466
BDBM50421576
NameBDBM50421576
Synonyms:CHEMBL325745
TypeSmall organic molecule
Emp. Form.C14H18N4O
Mol. Mass.258.3189
SMILESCCCNC(=O)c1ccccc1NCc1cnc[nH]1