Reaction Details
TargetAlpha-1D adrenergic receptor
LigandBDBM50027060
Substrate/Competitorn/a
Meas. Tech.ChEMBL_32519 (CHEMBL641400)
EC50 126±n/a nM
Citation Hodson, SJBigham, ECGarrison, DTGobel, MJIrving, PELiacos, JANavas, FSaussy, DLSherman, BWSpeake, JDBishop, MJ Alpha(1)-adrenoceptor activation: a comparison of 4-(anilinomethyl)imidazoles and 4-(phenoxymethyl)imidazoles to related 2-imidazolines. Bioorg Med Chem Lett12:3449-52 (2002) Alpha-1D adrenergic receptor
Name:Alpha-1D adrenergic receptor
Type:Enzyme Catalytic Domain
Mol. Mass.:60485.82
Organism:Homo sapiens (Human)
Description:adrenergic Alpha1D ADRA1D HUMAN::P25100
Residue:572
BDBM50027060
NameBDBM50027060
Synonyms:2-(2-Cyclopropyl-phenoxymethyl)-4,5-dihydro-1H-imidazole CHEMBL13852 | CIRAZOLINE
TypeSmall organic molecule
Emp. Form.C13H16N2O
Mol. Mass.216.2789
SMILESC(Oc1ccccc1C1CC1)C1=NCCN1