Reaction Details
TargetAlpha-1A adrenergic receptor
LigandBDBM50421578
Substrate/Competitorn/a
Meas. Tech.ChEMBL_32510 (CHEMBL641225)
EC50 3.2±n/a nM
Citation Hodson, SJBigham, ECGarrison, DTGobel, MJIrving, PELiacos, JANavas, FSaussy, DLSherman, BWSpeake, JDBishop, MJ Alpha(1)-adrenoceptor activation: a comparison of 4-(anilinomethyl)imidazoles and 4-(phenoxymethyl)imidazoles to related 2-imidazolines. Bioorg Med Chem Lett12:3449-52 (2002) Alpha-1A adrenergic receptor
Name:Alpha-1A adrenergic receptor
Type:Cell-surface receptors
Mol. Mass.:51511.67
Organism:Homo sapiens (Human)
Description:P35348
Residue:466
BDBM50421578
NameBDBM50421578
Synonyms:CHEMBL13789
TypeSmall organic molecule
Emp. Form.C16H16N2O
Mol. Mass.252.311
SMILESC(Oc1ccccc1-c1ccccc1)C1=NCCN1