Reaction Details
TargetAlpha-1D adrenergic receptor
LigandBDBM50027060
Substrate/Competitorn/a
Meas. Tech.ChEMBL_32574 (CHEMBL643412)
EC50 126±n/a nM
Citation Bishop, MJBarvian, KABerman, JBigham, ECGarrison, DTGobel, MJHodson, SJIrving, PELiacos, JANavas, FSaussy, DLSpeake, JD alpha(1)-Adrenoceptor agonists: the identification of novel alpha(1A )subtype selective 2'-heteroaryl-2-(phenoxymethyl)imidazolines. Bioorg Med Chem Lett12:471-5 (2002) Alpha-1D adrenergic receptor
Name:Alpha-1D adrenergic receptor
Type:Enzyme Catalytic Domain
Mol. Mass.:60485.82
Organism:Homo sapiens (Human)
Description:adrenergic Alpha1D ADRA1D HUMAN::P25100
Residue:572
BDBM50027060
NameBDBM50027060
Synonyms:2-(2-Cyclopropyl-phenoxymethyl)-4,5-dihydro-1H-imidazole CHEMBL13852 | CIRAZOLINE
TypeSmall organic molecule
Emp. Form.C13H16N2O
Mol. Mass.216.2789
SMILESC(Oc1ccccc1C1CC1)C1=NCCN1