Reaction Details
TargetAlpha-1A adrenergic receptor
LigandBDBM50000208
Substrate/Competitorn/a
Meas. Tech.ChEMBL_33755 (CHEMBL650229)
EC50 2.5±n/a nM
Citation Bishop, MJBarvian, KABerman, JBigham, ECGarrison, DTGobel, MJHodson, SJIrving, PELiacos, JANavas, FSaussy, DLSpeake, JD alpha(1)-Adrenoceptor agonists: the identification of novel alpha(1A )subtype selective 2'-heteroaryl-2-(phenoxymethyl)imidazolines. Bioorg Med Chem Lett12:471-5 (2002) Alpha-1A adrenergic receptor
Name:Alpha-1A adrenergic receptor
Type:Cell-surface receptors
Mol. Mass.:51511.67
Organism:Homo sapiens (Human)
Description:P35348
Residue:466
BDBM50000208
NameBDBM50000208
Synonyms:CHEMBL142871
TypeSmall organic molecule
Emp. Form.C13H13N3OS
Mol. Mass.259.327
SMILESC(Oc1ccccc1-c1nccs1)C1=NCCN1