Reaction Details
TargetAlpha-1D adrenergic receptor
LigandBDBM50421593
Substrate/Competitorn/a
Meas. Tech.ChEMBL_32574 (CHEMBL643412)
EC50 6.3±n/a nM
Citation Bishop, MJBarvian, KABerman, JBigham, ECGarrison, DTGobel, MJHodson, SJIrving, PELiacos, JANavas, FSaussy, DLSpeake, JD alpha(1)-Adrenoceptor agonists: the identification of novel alpha(1A )subtype selective 2'-heteroaryl-2-(phenoxymethyl)imidazolines. Bioorg Med Chem Lett12:471-5 (2002) Alpha-1D adrenergic receptor
Name:Alpha-1D adrenergic receptor
Type:Enzyme Catalytic Domain
Mol. Mass.:60485.82
Organism:Homo sapiens (Human)
Description:adrenergic Alpha1D ADRA1D HUMAN::P25100
Residue:572
BDBM50421593
NameBDBM50421593
Synonyms:CHEMBL357129
TypeSmall organic molecule
Emp. Form.C14H15N3O
Mol. Mass.241.2884
SMILESC(Oc1ccccc1-c1ccc[nH]1)C1=NCCN1