Reaction Details
TargetAlpha-1A adrenergic receptor
LigandBDBM50421593
Substrate/Competitorn/a
Meas. Tech.ChEMBL_33755 (CHEMBL650229)
EC50 1.3±n/a nM
Citation Bishop, MJBarvian, KABerman, JBigham, ECGarrison, DTGobel, MJHodson, SJIrving, PELiacos, JANavas, FSaussy, DLSpeake, JD alpha(1)-Adrenoceptor agonists: the identification of novel alpha(1A )subtype selective 2'-heteroaryl-2-(phenoxymethyl)imidazolines. Bioorg Med Chem Lett12:471-5 (2002) Alpha-1A adrenergic receptor
Name:Alpha-1A adrenergic receptor
Type:Cell-surface receptors
Mol. Mass.:51511.67
Organism:Homo sapiens (Human)
Description:P35348
Residue:466
BDBM50421593
NameBDBM50421593
Synonyms:CHEMBL357129
TypeSmall organic molecule
Emp. Form.C14H15N3O
Mol. Mass.241.2884
SMILESC(Oc1ccccc1-c1ccc[nH]1)C1=NCCN1