Reaction Details
TargetAlpha-1D adrenergic receptor
LigandBDBM50000210
Substrate/Competitorn/a
Meas. Tech.ChEMBL_32574 (CHEMBL643412)
EC50 13±n/a nM
Citation Bishop, MJBarvian, KABerman, JBigham, ECGarrison, DTGobel, MJHodson, SJIrving, PELiacos, JANavas, FSaussy, DLSpeake, JD alpha(1)-Adrenoceptor agonists: the identification of novel alpha(1A )subtype selective 2'-heteroaryl-2-(phenoxymethyl)imidazolines. Bioorg Med Chem Lett12:471-5 (2002) Alpha-1D adrenergic receptor
Name:Alpha-1D adrenergic receptor
Type:Enzyme Catalytic Domain
Mol. Mass.:60485.82
Organism:Homo sapiens (Human)
Description:adrenergic Alpha1D ADRA1D HUMAN::P25100
Residue:572
BDBM50000210
NameBDBM50000210
Synonyms:CHEMBL422477
TypeSmall organic molecule
Emp. Form.C14H14N2OS
Mol. Mass.258.339
SMILESC(Oc1ccccc1-c1ccsc1)C1=NCCN1