Reaction Details
TargetAlpha-1D adrenergic receptor
LigandBDBM50000207
Substrate/Competitorn/a
Meas. Tech.ChEMBL_32574 (CHEMBL643412)
EC50 25±n/a nM
Citation Bishop, MJBarvian, KABerman, JBigham, ECGarrison, DTGobel, MJHodson, SJIrving, PELiacos, JANavas, FSaussy, DLSpeake, JD alpha(1)-Adrenoceptor agonists: the identification of novel alpha(1A )subtype selective 2'-heteroaryl-2-(phenoxymethyl)imidazolines. Bioorg Med Chem Lett12:471-5 (2002) Alpha-1D adrenergic receptor
Name:Alpha-1D adrenergic receptor
Type:Enzyme Catalytic Domain
Mol. Mass.:60485.82
Organism:Homo sapiens (Human)
Description:adrenergic Alpha1D ADRA1D HUMAN::P25100
Residue:572
BDBM50000207
NameBDBM50000207
Synonyms:CHEMBL142387
TypeSmall organic molecule
Emp. Form.C13H13N3OS
Mol. Mass.259.327
SMILESC(Oc1ccccc1-c1ccns1)C1=NCCN1