Reaction Details
TargetAlpha-1A adrenergic receptor
LigandBDBM50000216
Substrate/Competitorn/a
Meas. Tech.ChEMBL_33755 (CHEMBL650229)
EC50 1±n/a nM
Citation Bishop, MJBarvian, KABerman, JBigham, ECGarrison, DTGobel, MJHodson, SJIrving, PELiacos, JANavas, FSaussy, DLSpeake, JD alpha(1)-Adrenoceptor agonists: the identification of novel alpha(1A )subtype selective 2'-heteroaryl-2-(phenoxymethyl)imidazolines. Bioorg Med Chem Lett12:471-5 (2002) Alpha-1A adrenergic receptor
Name:Alpha-1A adrenergic receptor
Type:Cell-surface receptors
Mol. Mass.:51511.67
Organism:Homo sapiens (Human)
Description:P35348
Residue:466
BDBM50000216
NameBDBM50000216
Synonyms:CHEMBL143801
TypeSmall organic molecule
Emp. Form.C14H14N2OS
Mol. Mass.258.339
SMILESC(Oc1ccccc1-c1cccs1)C1=NCCN1