Reaction Details
TargetAlpha-1A adrenergic receptor
LigandBDBM50219080
Substrate/Competitorn/a
Meas. Tech.ChEMBL_33758 (CHEMBL650231)
EC50 0.851138±n/a nM
Citation Navas, FBishop, MJGarrison, DTHodson, SJSpeake, JDBigham, ECDrewry, DHSaussy, DLLiacos, JHIrving, PEGobel, MJ 2-(anilinomethyl)imidazolines as alpha1A adrenergic receptor agonists: 2'-heteroaryl and 2'-oxime ether series. Bioorg Med Chem Lett12:575-9 (2002) Alpha-1A adrenergic receptor
Name:Alpha-1A adrenergic receptor
Type:Cell-surface receptors
Mol. Mass.:51511.67
Organism:Homo sapiens (Human)
Description:P35348
Residue:466
BDBM50219080
NameBDBM50219080
Synonyms:CHEMBL152693
TypeSmall organic molecule
Emp. Form.C15H17N3S
Mol. Mass.271.381
SMILESCc1ccsc1-c1ccccc1NCC1=NCCN1