Reaction Details
TargetAlpha-1D adrenergic receptor
LigandBDBM50219153
Substrate/Competitorn/a
Meas. Tech.ChEMBL_32582 (CHEMBL643420)
EC50 0.501187±n/a nM
Citation Navas, FBishop, MJGarrison, DTHodson, SJSpeake, JDBigham, ECDrewry, DHSaussy, DLLiacos, JHIrving, PEGobel, MJ 2-(anilinomethyl)imidazolines as alpha1A adrenergic receptor agonists: 2'-heteroaryl and 2'-oxime ether series. Bioorg Med Chem Lett12:575-9 (2002) Alpha-1D adrenergic receptor
Name:Alpha-1D adrenergic receptor
Type:Enzyme Catalytic Domain
Mol. Mass.:60485.82
Organism:Homo sapiens (Human)
Description:adrenergic Alpha1D ADRA1D HUMAN::P25100
Residue:572
BDBM50219153
NameBDBM50219153
Synonyms:CHEMBL414185
TypeSmall organic molecule
Emp. Form.C12H15N3O2
Mol. Mass.233.2664
SMILESCOC(=O)c1ccccc1NCC1=NCCN1