Reaction Details
TargetAlpha-1A adrenergic receptor
LigandBDBM50219165
Substrate/Competitorn/a
Meas. Tech.ChEMBL_33758 (CHEMBL650231)
EC50 2.2±n/a nM
Citation Navas, FBishop, MJGarrison, DTHodson, SJSpeake, JDBigham, ECDrewry, DHSaussy, DLLiacos, JHIrving, PEGobel, MJ 2-(anilinomethyl)imidazolines as alpha1A adrenergic receptor agonists: 2'-heteroaryl and 2'-oxime ether series. Bioorg Med Chem Lett12:575-9 (2002) Alpha-1A adrenergic receptor
Name:Alpha-1A adrenergic receptor
Type:Cell-surface receptors
Mol. Mass.:51511.67
Organism:Homo sapiens (Human)
Description:P35348
Residue:466
BDBM50219165
NameBDBM50219165
Synonyms:CHEMBL346380
TypeSmall organic molecule
Emp. Form.C14H15N3S
Mol. Mass.257.354
SMILESC(Nc1ccccc1-c1cccs1)C1=NCCN1