Reaction Details
TargetAlpha-1D adrenergic receptor
LigandBDBM50219080
Substrate/Competitorn/a
Meas. Tech.ChEMBL_32582 (CHEMBL643420)
EC50 49±n/a nM
Citation Navas, FBishop, MJGarrison, DTHodson, SJSpeake, JDBigham, ECDrewry, DHSaussy, DLLiacos, JHIrving, PEGobel, MJ 2-(anilinomethyl)imidazolines as alpha1A adrenergic receptor agonists: 2'-heteroaryl and 2'-oxime ether series. Bioorg Med Chem Lett12:575-9 (2002) Alpha-1D adrenergic receptor
Name:Alpha-1D adrenergic receptor
Type:Enzyme Catalytic Domain
Mol. Mass.:60485.82
Organism:Homo sapiens (Human)
Description:adrenergic Alpha1D ADRA1D HUMAN::P25100
Residue:572
BDBM50219080
NameBDBM50219080
Synonyms:CHEMBL152693
TypeSmall organic molecule
Emp. Form.C15H17N3S
Mol. Mass.271.381
SMILESCc1ccsc1-c1ccccc1NCC1=NCCN1