Reaction Details
TargetAlpha-1D adrenergic receptor
LigandBDBM50421599
Substrate/Competitorn/a
Meas. Tech.ChEMBL_32582 (CHEMBL643420)
EC50 5±n/a nM
Citation Navas, FBishop, MJGarrison, DTHodson, SJSpeake, JDBigham, ECDrewry, DHSaussy, DLLiacos, JHIrving, PEGobel, MJ 2-(anilinomethyl)imidazolines as alpha1A adrenergic receptor agonists: 2'-heteroaryl and 2'-oxime ether series. Bioorg Med Chem Lett12:575-9 (2002) Alpha-1D adrenergic receptor
Name:Alpha-1D adrenergic receptor
Type:Enzyme Catalytic Domain
Mol. Mass.:60485.82
Organism:Homo sapiens (Human)
Description:adrenergic Alpha1D ADRA1D HUMAN::P25100
Residue:572
BDBM50421599
NameBDBM50421599
Synonyms:CHEMBL155326
TypeSmall organic molecule
Emp. Form.C13H14N4O
Mol. Mass.242.2765
SMILESC(Nc1ccccc1-c1ncco1)C1=NCCN1