Reaction Details
TargetAlpha-1D adrenergic receptor
LigandBDBM50219165
Substrate/Competitorn/a
Meas. Tech.ChEMBL_32582 (CHEMBL643420)
EC50 18±n/a nM
Citation Navas, FBishop, MJGarrison, DTHodson, SJSpeake, JDBigham, ECDrewry, DHSaussy, DLLiacos, JHIrving, PEGobel, MJ 2-(anilinomethyl)imidazolines as alpha1A adrenergic receptor agonists: 2'-heteroaryl and 2'-oxime ether series. Bioorg Med Chem Lett12:575-9 (2002) Alpha-1D adrenergic receptor
Name:Alpha-1D adrenergic receptor
Type:Enzyme Catalytic Domain
Mol. Mass.:60485.82
Organism:Homo sapiens (Human)
Description:adrenergic Alpha1D ADRA1D HUMAN::P25100
Residue:572
BDBM50219165
NameBDBM50219165
Synonyms:CHEMBL346380
TypeSmall organic molecule
Emp. Form.C14H15N3S
Mol. Mass.257.354
SMILESC(Nc1ccccc1-c1cccs1)C1=NCCN1