Reaction Details
TargetAlpha-1D adrenergic receptor
LigandBDBM50222907
Substrate/Competitorn/a
Meas. Tech.ChEMBL_32580 (CHEMBL643418)
EC50 16±n/a nM
Citation Speake, JDNavas, FBishop, MJGarrison, DTBigham, ECHodson, SJSaussy, DLLiacos, JAIrving, PESherman, BW 2-(Anilinomethyl)imidazolines as alpha1 adrenergic receptor agonists: alpha1a subtype selective 2'-heteroaryl compounds. Bioorg Med Chem Lett13:1183-6 (2003) Alpha-1D adrenergic receptor
Name:Alpha-1D adrenergic receptor
Type:Enzyme Catalytic Domain
Mol. Mass.:60485.82
Organism:Homo sapiens (Human)
Description:adrenergic Alpha1D ADRA1D HUMAN::P25100
Residue:572
BDBM50222907
NameBDBM50222907
Synonyms:CHEMBL17856
TypeSmall organic molecule
Emp. Form.C14H17N5
Mol. Mass.255.3183
SMILESCn1ccc(n1)-c1ccccc1NCC1=NCCN1