Reaction Details
TargetAlpha-1A adrenergic receptor
LigandBDBM50222905
Substrate/Competitorn/a
Meas. Tech.ChEMBL_33756 (CHEMBL858097)
EC50 2±n/a nM
Citation Speake, JDNavas, FBishop, MJGarrison, DTBigham, ECHodson, SJSaussy, DLLiacos, JAIrving, PESherman, BW 2-(Anilinomethyl)imidazolines as alpha1 adrenergic receptor agonists: alpha1a subtype selective 2'-heteroaryl compounds. Bioorg Med Chem Lett13:1183-6 (2003) Alpha-1A adrenergic receptor
Name:Alpha-1A adrenergic receptor
Type:Cell-surface receptors
Mol. Mass.:51511.67
Organism:Homo sapiens (Human)
Description:P35348
Residue:466
BDBM50222905
NameBDBM50222905
Synonyms:CHEMBL18069
TypeSmall organic molecule
Emp. Form.C13H16N6
Mol. Mass.256.3063
SMILESCn1ncnc1-c1ccccc1NCC1=NCCN1