Reaction Details
TargetAlpha-1A adrenergic receptor
LigandBDBM50219153
Substrate/Competitorn/a
Meas. Tech.ChEMBL_33757 (CHEMBL650230)
EC50 0.794328±n/a nM
Citation Speake, JDNavas, FBishop, MJGarrison, DTBigham, ECHodson, SJSaussy, DLLiacos, JAIrving, PESherman, BW 2-(Anilinomethyl)imidazolines as alpha1 adrenergic receptor agonists: alpha1a subtype selective 2'-heteroaryl compounds. Bioorg Med Chem Lett13:1183-6 (2003) Alpha-1A adrenergic receptor
Name:Alpha-1A adrenergic receptor
Type:Cell-surface receptors
Mol. Mass.:51511.67
Organism:Homo sapiens (Human)
Description:P35348
Residue:466
BDBM50219153
NameBDBM50219153
Synonyms:CHEMBL414185
TypeSmall organic molecule
Emp. Form.C12H15N3O2
Mol. Mass.233.2664
SMILESCOC(=O)c1ccccc1NCC1=NCCN1