Reaction Details
Target5-hydroxytryptamine receptor 1B
LigandBDBM36108
Substrate/Competitorn/a
Meas. Tech.ChEBML_1813
IC50 490±n/a nM
Citation Hibert, MFGittos, MWMiddlemiss, DNMir, AKFozard, JR Graphics computer-aided receptor mapping as a predictive tool for drug design: development of potent, selective, and stereospecific ligands for the 5-HT1A receptor. J Med Chem31:1087-93 (1988) 5-hydroxytryptamine receptor 1B
Name:5-hydroxytryptamine receptor 1B
Type:Protein
Mol. Mass.:43173.33
Organism:Rattus norvegicus (Rat)
Description:P28564
Residue:386
BDBM36108
NameBDBM36108
Synonyms:(R)-propranolol
TypeGuest
Emp. Form.C16H22NO2
Mol. Mass.260.3508
SMILESCC(C)[NH2+]C[C@@H](O)COc1cccc2ccccc12