Reaction Details
TargetSigma non-opioid intracellular receptor 1
LigandBDBM50421913
Substrate/Competitorn/a
Meas. Tech.ChEBML_201733
IC50 1.8±n/a nM
Citation Russell, MGBaker, RBillington, DCKnight, AKMiddlemiss, DNNoble, AJ Benz[f]isoquinoline analogues as high-affinity sigma ligands. J Med Chem35:2025-33 (1992) Sigma non-opioid intracellular receptor 1
Name:Sigma non-opioid intracellular receptor 1
Type:Enzyme Catalytic Domain
Mol. Mass.:25124.85
Organism:Homo sapiens (Human)
Description:Q99720
Residue:223
BDBM50421913
NameBDBM50421913
Synonyms:CHEMBL545682
TypeSmall organic molecule
Emp. Form.C20H23N
Mol. Mass.277.4033
SMILESC(N1CC[C@@H]2[C@@H](CCc3ccccc23)C1)c1ccccc1