Reaction Details
TargetSigma non-opioid intracellular receptor 1
LigandBDBM50421954
Substrate/Competitorn/a
Meas. Tech.ChEBML_201732
IC50 1.5±n/a nM
Citation Chambers, MSBaker, RBillington, DCKnight, AKMiddlemiss, DNWong, EH Spiropiperidines as high-affinity, selective sigma ligands. J Med Chem35:2033-9 (1992) Sigma non-opioid intracellular receptor 1
Name:Sigma non-opioid intracellular receptor 1
Type:Enzyme Catalytic Domain
Mol. Mass.:25124.85
Organism:Homo sapiens (Human)
Description:Q99720
Residue:223
BDBM50421954
NameBDBM50421954
Synonyms:CHEMBL1744015
TypeSmall organic molecule
Emp. Form.C19H29N
Mol. Mass.271.4403
SMILESCCCCCCN1CCC2(CCc3ccccc23)CC1