Reaction Details
TargetBeta-2 adrenergic receptor
LigandBDBM82493
Substrate/Competitorn/a
Meas. Tech.ChEMBL_38152 (CHEMBL651043)
Ki 58±n/a nM
Citation Markovich, KMTantishaiyakul, VHamada, AMiller, DDRomstedt, KJShams, GShin, YFraundorfer, PFDoyle, KFeller, DR Synthesis of halogenated trimetoquinol derivatives and evaluation of their beta-agonist and thromboxane A2 (TXA2) antagonist activities. J Med Chem35:466-79 (1992) Beta-2 adrenergic receptor
Name:Beta-2 adrenergic receptor
Type:Enzyme Catalytic Domain
Mol. Mass.:46993.24
Organism:GUINEA PIG
Description:adrenergic Beta2 ADRB2 GUINEA PIG::Q8K4Z4
Residue:418
BDBM82493
NameBDBM82493
Synonyms:CAS_128658 TMQ, (+/-)-8-Fluoro
TypeSmall organic molecule
Emp. Form.C19H22FNO5
Mol. Mass.363.3801
SMILESCOc1cc(CC2NCCc3cc(O)c(O)c(F)c23)cc(OC)c1OC