Reaction Details
TargetAdenosine receptor A1
LigandBDBM50367273
Substrate/Competitorn/a
Meas. Tech.ChEMBL_27466 (CHEMBL642476)
IC50 4.9±n/a nM
Citation van der Wenden, EMIjzerman, APSoudijn, W A steric and electrostatic comparison of three models for the agonist/antagonist binding site on the adenosine A1 receptor. J Med Chem35:629-35 (1992) Adenosine receptor A1
Name:Adenosine receptor A1
Type:Protein
Mol. Mass.:36704.13
Organism:Rattus norvegicus (rat)
Description:n/a
Residue:326
BDBM50367273
NameBDBM50367273
Synonyms:CHEMBL605042
TypeSmall organic molecule
Emp. Form.C17H19N5O4
Mol. Mass.357.3639
SMILESCc1ccc(Nc2ncnc3n(cnc23)C2O[C@H](CO)[C@@H](O)[C@H]2O)cc1