Reaction Details
TargetSigma non-opioid intracellular receptor 1
LigandBDBM50366495
Substrate/Competitorn/a
Meas. Tech.ChEMBL_201132 (CHEMBL805753)
IC50 52±n/a nM
Citation Myers, AMCharifson, PSOwens, CEKula, NSMcPhail, ATBaldessarini, RJBooth, RGWyrick, SD Conformational analysis, pharmacophore identification, and comparative molecular field analysis of ligands for the neuromodulatory sigma 3 receptor. J Med Chem37:4109-17 (1995) Sigma non-opioid intracellular receptor 1
Name:Sigma non-opioid intracellular receptor 1
Type:Enzyme Catalytic Domain
Mol. Mass.:25124.85
Organism:Homo sapiens (Human)
Description:Q99720
Residue:223
BDBM50366495
NameBDBM50366495
Synonyms:(+)butaclamol | CHEMBL1255588
TypeSmall organic molecule
Emp. Form.C25H31NO
Mol. Mass.361.5197
SMILESCC(C)(C)[C@@]1(O)CCN2C[C@@H]3c4ccccc4CCc4cccc([C@H]2C1)c34