Reaction Details
TargetReverse transcriptase/RNaseH
LigandBDBM1284
Substrate/Competitorn/a
Meas. Tech.ChEMBL_196348 (CHEMBL802044)
IC50 331±n/a nM
Citation Gibson, SMcGuire, RRees, DC Principal components describing biological activities and molecular diversity of heterocyclic aromatic ring fragments. J Med Chem39:4065-72 (1996) 
 
Reverse transcriptase/RNaseH
Name:Reverse transcriptase/RNaseH
Type:PROTEIN
Mol. Mass.:65229.15
Organism:Human immunodeficiency virus 1
Description:ChEMBL_1473730
Residue:566
BDBM1284
NameBDBM1284
Synonyms:3-Aminopyridin-2(1H)-one analogue 4 CHEMBL316785 | Pyridinone deriv. 8
TypeSmall organic molecule
Emp. Form.C17H18N2O2
Mol. Mass.282.337
SMILESCCc1cc(NCc2cc3ccccc3o2)c(=O)[nH]c1C