Reaction Details
TargetReverse transcriptase/RNaseH
LigandBDBM1293
Substrate/Competitorn/a
Meas. Tech.ChEMBL_196348 (CHEMBL802044)
IC50 2089±n/a nM
Citation Gibson, SMcGuire, RRees, DC Principal components describing biological activities and molecular diversity of heterocyclic aromatic ring fragments. J Med Chem39:4065-72 (1996) 
 
Reverse transcriptase/RNaseH
Name:Reverse transcriptase/RNaseH
Type:PROTEIN
Mol. Mass.:65229.15
Organism:Human immunodeficiency virus 1
Description:ChEMBL_1473730
Residue:566
BDBM1293
NameBDBM1293
Synonyms:3-Aminopyridin-2(1H)-one analogue 13 CHEMBL125873
TypeSmall organic molecule
Emp. Form.C19H20N2O
Mol. Mass.292.3749
SMILESCCc1cc(NCc2cccc3ccccc23)c(=O)[nH]c1C