Reaction Details
TargetReverse transcriptase/RNaseH
LigandBDBM1286
Substrate/Competitorn/a
Meas. Tech.ChEMBL_196348 (CHEMBL802044)
IC50 339±n/a nM
Citation Gibson, SMcGuire, RRees, DC Principal components describing biological activities and molecular diversity of heterocyclic aromatic ring fragments. J Med Chem39:4065-72 (1996) 
 
Reverse transcriptase/RNaseH
Name:Reverse transcriptase/RNaseH
Type:PROTEIN
Mol. Mass.:65229.15
Organism:Human immunodeficiency virus 1
Description:ChEMBL_1473730
Residue:566
BDBM1286
NameBDBM1286
Synonyms:3-Aminopyridin-2(1H)-one analogue 6 CHEMBL125510
TypeSmall organic molecule
Emp. Form.C18H19N3O
Mol. Mass.293.363
SMILESCCc1cc(NCc2cnc3ccccc3c2)c(=O)[nH]c1C