Reaction Details
TargetReverse transcriptase/RNaseH
LigandBDBM1298
Substrate/Competitorn/a
Meas. Tech.ChEMBL_196348 (CHEMBL802044)
IC50 5370±n/a nM
Citation Gibson, SMcGuire, RRees, DC Principal components describing biological activities and molecular diversity of heterocyclic aromatic ring fragments. J Med Chem39:4065-72 (1996) 
 
Reverse transcriptase/RNaseH
Name:Reverse transcriptase/RNaseH
Type:PROTEIN
Mol. Mass.:65229.15
Organism:Human immunodeficiency virus 1
Description:ChEMBL_1473730
Residue:566
BDBM1298
NameBDBM1298
Synonyms:2-pyridinone deriv. 28 3-Aminopyridin-2(1H)-one analogue 18 | CHEMBL86064
TypeSmall organic molecule
Emp. Form.C15H18N2O
Mol. Mass.242.3162
SMILESCCc1cc(NCc2ccccc2)c(=O)[nH]c1C