Reaction Details
TargetVoltage-dependent L-type calcium channel subunit alpha-1D
LigandBDBM50422191
Substrate/Competitorn/a
Meas. Tech.ChEMBL_92799 (CHEMBL703977)
IC50 12±n/a nM
Citation Corelli, FManetti, FTafi, ACampiani, GNacci, VBotta, M Diltiazem-like calcium entry blockers: a hypothesis of the receptor-binding site based on a comparative molecular field analysis model. J Med Chem40:125-31 (1997) 
 
Voltage-dependent L-type calcium channel subunit alpha-1D
Name:Voltage-dependent L-type calcium channel subunit alpha-1D
Type:PROTEIN
Mol. Mass.:250148.41
Organism:Rattus norvegicus
Description:ChEMBL_44709
Residue:2203
BDBM50422191
NameBDBM50422191
Synonyms:CHEMBL24998
TypeSmall organic molecule
Emp. Form.C24H30N2O2S
Mol. Mass.410.572
SMILESCCC(C)NCc1ccc2C(Sc3ccccc3-n12)C1=CCC(OC)(OC)C=C1