Reaction Details
TargetGag-Pol polyprotein [489-587]
LigandBDBM1040
Substrate/Competitorn/a
Meas. Tech.ChEMBL_158029 (CHEMBL877854)
IC50 0.26±n/a nM
Citation Pérez, CPastor, MOrtiz, ARGago, F Comparative binding energy analysis of HIV-1 protease inhibitors: incorporation of solvent effects and validation as a powerful tool in receptor-based drug design. J Med Chem41:836-52 (1998) 
 
Gag-Pol polyprotein [489-587]
Name:Gag-Pol polyprotein [489-587]
Type:Enzyme Subunit
Mol. Mass.:10781.16
Organism:Human immunodeficiency virus type 1
Description:P04585[489-587]
Residue:99
BDBM1040
NameBDBM1040
Synonyms:CHEMBL296484 tert-butyl N-[(2S,3S,5R)-3-hydroxy-5-{[(1S,2R)-2-hydroxy-2,3-dihydro-1H-inden-1-yl]carbamoyl}-1-phenyl-5-{[4-(trifluoromethyl)phenyl]methyl}pentan-2-yl]carbamate
TypeSmall organic molecule
Emp. Form.C34H39F3N2O5
Mol. Mass.612.6791
SMILES[H][C@@]1(NC(=O)[C@@H](C[C@H](O)[C@H](Cc2ccccc2)NC(=O)OC(C)(C)C)Cc2ccc(cc2)C(F)(F)F)[C@H](O)Cc2ccccc12