Reaction Details
TargetPotassium voltage-gated channel subfamily H member 2
LigandBDBM50010859
Substrate/Competitorn/a
Meas. Tech.ChEMBL_307283 (CHEMBL832278)
IC50 3388±n/a nM
Citation Rajamani, RTounge, BALi, JReynolds, CH A two-state homology model of the hERG K+ channel: application to ligand binding. Bioorg Med Chem Lett15:1737-41 (2005) 
 
Potassium voltage-gated channel subfamily H member 2
Name:Potassium voltage-gated channel subfamily H member 2
Type:Multi-pass membrane protein
Mol. Mass.:126672.65
Organism:Homo sapiens (Human)
Description:Q12809
Residue:1159
BDBM50010859
NameBDBM50010859
Synonyms:CHEMBL11 IMIPRAMINE PAMOATE | Imipramin
TypeSmall organic molecule
Emp. Form.C19H24N2
Mol. Mass.280.4073
SMILESCN(C)CCCN1c2ccccc2CCc2ccccc12