Reaction Details
TargetPotassium voltage-gated channel subfamily H member 2
LigandBDBM50117924
Substrate/Competitorn/a
Meas. Tech.ChEMBL_307282 (CHEMBL832277)
IC50 77625±n/a nM
Citation Rajamani, RTounge, BALi, JReynolds, CH A two-state homology model of the hERG K+ channel: application to ligand binding. Bioorg Med Chem Lett15:1737-41 (2005) 
 
Potassium voltage-gated channel subfamily H member 2
Name:Potassium voltage-gated channel subfamily H member 2
Type:Multi-pass membrane protein
Mol. Mass.:126672.65
Organism:Homo sapiens (Human)
Description:Q12809
Residue:1159
BDBM50117924
NameBDBM50117924
Synonyms:1-Cyclopropyl-6-fluoro-5-methyl-7-(3-methyl-piperazin-1-yl)-4-oxo-1,4,4a,8a-tetrahydro-quinoline-3-carboxylic acid (Grepafloxacin) 1-cyclopropyl-6-fluoro-5-methyl-7-(3-methylpiperazin-1-yl)-4-oxo-1,4-dihydroquinoline-3-carboxylic acid GREPAFLOXACIN | Raxar
TypeSmall organic molecule
Emp. Form.C19H22FN3O3
Mol. Mass.359.3947
SMILESCC1CN(CCN1)c1cc2n(cc(C(O)=O)c(=O)c2c(C)c1F)C1CC1