Reaction Details
TargetDelta-type opioid receptor
LigandBDBM50422791
Substrate/Competitorn/a
Meas. Tech.ChEMBL_334062 (CHEMBL861271)
IC50 0.005±n/a nM
Citation Middleton, DSMaw, GNChallenger, CJessiman, AJohnson, PSMillion, WANichols, CLPrice, JATrevethick, M Highly potent and selective zwitterionic agonists of the delta-opioid receptor. Part 1. Bioorg Med Chem Lett16:905-10 (2006) 
 
Delta-type opioid receptor
Name:Delta-type opioid receptor
Type:Enzyme Catalytic Domain
Mol. Mass.:40577.25
Organism:MOUSE
Description:P32300
Residue:372
BDBM50422791
NameBDBM50422791
Synonyms:CHEMBL204480
TypeSmall organic molecule
Emp. Form.C32H39N3O3
Mol. Mass.513.6704
SMILESC[C@@H]1CN([C@@H](c2cccc(O)c2)c2ccc3CCN(CCC(O)=O)Cc3c2)[C@@H](C)CN1Cc1ccccc1