Reaction Details
TargetDelta-type opioid receptor
LigandBDBM50422794
Substrate/Competitorn/a
Meas. Tech.ChEMBL_334062 (CHEMBL861271)
IC50 100.0±n/a nM
Citation Middleton, DSMaw, GNChallenger, CJessiman, AJohnson, PSMillion, WANichols, CLPrice, JATrevethick, M Highly potent and selective zwitterionic agonists of the delta-opioid receptor. Part 1. Bioorg Med Chem Lett16:905-10 (2006) 
 
Delta-type opioid receptor
Name:Delta-type opioid receptor
Type:Enzyme Catalytic Domain
Mol. Mass.:40577.25
Organism:MOUSE
Description:P32300
Residue:372
BDBM50422794
NameBDBM50422794
Synonyms:CHEMBL202557
TypeSmall organic molecule
Emp. Form.C32H38FN3O2
Mol. Mass.515.6614
SMILESC[C@@H]1CN([C@@H](c2cccc(F)c2)c2ccc3CCN(CCC(O)=O)Cc3c2)[C@@H](C)CN1Cc1ccccc1