Reaction Details
TargetDelta-type opioid receptor
LigandBDBM50422792
Substrate/Competitorn/a
Meas. Tech.ChEMBL_334062 (CHEMBL861271)
IC50 2.00±n/a nM
Citation Middleton, DSMaw, GNChallenger, CJessiman, AJohnson, PSMillion, WANichols, CLPrice, JATrevethick, M Highly potent and selective zwitterionic agonists of the delta-opioid receptor. Part 1. Bioorg Med Chem Lett16:905-10 (2006) 
 
Delta-type opioid receptor
Name:Delta-type opioid receptor
Type:Enzyme Catalytic Domain
Mol. Mass.:40577.25
Organism:MOUSE
Description:P32300
Residue:372
BDBM50422792
NameBDBM50422792
Synonyms:CHEMBL202478
TypeSmall organic molecule
Emp. Form.C32H39N3O3
Mol. Mass.513.6704
SMILESCOc1cccc(c1)[C@H](N1C[C@@H](C)N(Cc2ccccc2)C[C@@H]1C)c1ccc2CCN(CC(O)=O)Cc2c1