Reaction Details
TargetKappa-type opioid receptor
LigandBDBM50422798
Substrate/Competitorn/a
Meas. Tech.ChEMBL_334064 (CHEMBL861856)
IC50 1259±n/a nM
Citation Middleton, DSMaw, GNChallenger, CJessiman, AJohnson, PSMillion, WANichols, CLPrice, JATrevethick, M Highly potent and selective zwitterionic agonists of the delta-opioid receptor. Part 1. Bioorg Med Chem Lett16:905-10 (2006) 
 
Kappa-type opioid receptor
Name:Kappa-type opioid receptor
Type:G Protein-Coupled Receptor (GPCR)
Mol. Mass.:42744.99
Organism:Cavia porcellus (domestic guinea pig)
Description:P41144
Residue:380
BDBM50422798
NameBDBM50422798
Synonyms:CHEMBL201678
TypeSmall organic molecule
Emp. Form.C30H35N3O3
Mol. Mass.485.6172
SMILESC[C@@H]1CN([C@H](c2ccc3CN(CC(O)=O)Cc3c2)c2cccc(O)c2)[C@@H](C)CN1Cc1ccccc1