Reaction Details
TargetCannabinoid receptor 2
LigandBDBM50422830
Substrate/Competitorn/a
Meas. Tech.ChEMBL_338902 (CHEMBL861409)
IC50 100±n/a nM
Citation Raitio, KHSavinainen, JRVepsäläinen, JLaitinen, JTPoso, AJärvinen, TNevalainen, T Synthesis and SAR studies of 2-oxoquinoline derivatives as CB2 receptor inverse agonists. J Med Chem49:2022-7 (2006) 
 
Cannabinoid receptor 2
Name:Cannabinoid receptor 2
Type:G Protein-Coupled Receptor (GPCR)
Mol. Mass.:39690.94
Organism:Homo sapiens (Human)
Description:P34972
Residue:360
BDBM50422830
NameBDBM50422830
Synonyms:CHEMBL201989
TypeSmall organic molecule
Emp. Form.C24H27N3O6
Mol. Mass.453.4877
SMILESCCCCCOc1c(OC)ccc2cc(C(=O)NCCc3ccc(cc3)[N+]([O-])=O)c(=O)[nH]c12