Reaction Details
TargetCannabinoid receptor 2
LigandBDBM85739
Substrate/Competitorn/a
Meas. Tech.ChEMBL_338902 (CHEMBL861409)
IC50 25±n/a nM
Citation Raitio, KHSavinainen, JRVepsäläinen, JLaitinen, JTPoso, AJärvinen, TNevalainen, T Synthesis and SAR studies of 2-oxoquinoline derivatives as CB2 receptor inverse agonists. J Med Chem49:2022-7 (2006) 
 
Cannabinoid receptor 2
Name:Cannabinoid receptor 2
Type:G Protein-Coupled Receptor (GPCR)
Mol. Mass.:39690.94
Organism:Homo sapiens (Human)
Description:P34972
Residue:360
BDBM85739
NameBDBM85739
Synonyms:CHEMBL178372 N-(1,3-Benzodioxole-5-ylmethyl)-2-oxo-7-methoxy-8-pentoxy-1,2-dihydro-3-quinolinecarboxamide
TypeSmall organic molecule
Emp. Form.C24H26N2O6
Mol. Mass.438.473
SMILESCCCCCOc1c(OC)ccc2cc(C(=O)NCc3ccc4OCOc4c3)c(=O)[nH]c12