Reaction Details
TargetCannabinoid receptor 2
LigandBDBM50422834
Substrate/Competitorn/a
Meas. Tech.ChEMBL_338902 (CHEMBL861409)
IC50 10.0±n/a nM
Citation Raitio, KHSavinainen, JRVepsäläinen, JLaitinen, JTPoso, AJärvinen, TNevalainen, T Synthesis and SAR studies of 2-oxoquinoline derivatives as CB2 receptor inverse agonists. J Med Chem49:2022-7 (2006) 
 
Cannabinoid receptor 2
Name:Cannabinoid receptor 2
Type:G Protein-Coupled Receptor (GPCR)
Mol. Mass.:39690.94
Organism:Homo sapiens (Human)
Description:P34972
Residue:360
BDBM50422834
NameBDBM50422834
Synonyms:CHEMBL204387
TypeSmall organic molecule
Emp. Form.C24H28N2O5
Mol. Mass.424.4895
SMILESCCCCCOc1c(OC)ccc2cc(C(=O)NCCc3ccc(O)cc3)c(=O)[nH]c12