Reaction Details
TargetMetabotropic glutamate receptor 1
LigandBDBM50423047
Substrate/Competitorn/a
Meas. Tech.ChEMBL_441184 (CHEMBL891403)
IC50 20±n/a nM
Citation Micheli, FCavanni, PDi Fabio, RDonati, DHamdan, MProvera, STranquillini, MEVitulli, G 13C bis-labeled pyrroles: a tool for the identification of the rat metabolism of 3-methyl pyrrole-2,4-dicarboxylic acid 2-propyl ester 4-(1,2,2-trimethyl-propyl) ester. Bioorg Med Chem Lett17:969-73 (2007) 
 
Metabotropic glutamate receptor 1
Name:Metabotropic glutamate receptor 1
Type:Enzyme
Mol. Mass.:132358.19
Organism:Homo sapiens (Human)
Description:Q13255
Residue:1194
BDBM50423047
NameBDBM50423047
Synonyms:CHEMBL396593
TypeSmall organic molecule
Emp. Form.C16H21NO4
Mol. Mass.291.3422
SMILESCCOC(=O)c1[nH]cc(C(=O)OC2CC3CCC2C3)c1C