Reaction Details
TargetInterstitial collagenase
LigandBDBM50063920
Substrate/Competitorn/a
Meas. Tech.ChEMBL_458935 (CHEMBL924954)
IC50 5.0±n/a nM
Citation Verma, RPHansch, C Matrix metalloproteinases (MMPs): chemical-biological functions and (Q)SARs. Bioorg Med Chem15:2223-68 (2007) 
 
Interstitial collagenase
Name:Interstitial collagenase
Type:Enzyme
Mol. Mass.:54010.26
Organism:Homo sapiens (Human)
Description: P03956
Residue:469
BDBM50063920
NameBDBM50063920
Synonyms:(R)-N*1*-((S)-2,2-Dimethyl-1-methylcarbamoyl-propyl)-N*4*-hydroxy-2-isobutyl-succinamide CHEMBL16520 | Ro-31-9790
TypeSmall organic molecule
Emp. Form.C15H29N3O4
Mol. Mass.315.4085
SMILESCNC(=O)[C@@H](NC(=O)[C@H](CC(C)C)CC(=O)NO)C(C)(C)C