Reaction Details
TargetStromelysin-1
LigandBDBM50057090
Substrate/Competitorn/a
Meas. Tech.ChEMBL_458939 (CHEMBL924958)
Ki 18±n/a nM
Citation Verma, RPHansch, C Matrix metalloproteinases (MMPs): chemical-biological functions and (Q)SARs. Bioorg Med Chem15:2223-68 (2007) 
 
Stromelysin-1
Name:Stromelysin-1
Type:Enzyme
Mol. Mass.:53973.13
Organism:Homo sapiens (Human)
Description: P08254
Residue:477
BDBM50057090
NameBDBM50057090
Synonyms:(R)-2-((S)-1-((S)-4-methyl-1-oxo-1-(phenylamino)pentan-2-ylamino)-1-oxo-4-(4-propylphenyl)butan-2-ylamino)propanoic acid (R)-2-[(S)-1-(3-Methyl-1-phenylcarbamoyl-butylcarbamoyl)-3-(4-propyl-phenyl)-propylamino]-propionic acid | CHEMBL8474
TypeSmall organic molecule
Emp. Form.C28H39N3O4
Mol. Mass.481.627
SMILESCCCc1ccc(CC[C@H](N[C@H](C)C(O)=O)C(=O)N[C@@H](CC(C)C)C(=O)Nc2ccccc2)cc1