Reaction Details
TargetMatrix metalloproteinase-14
LigandBDBM50423397
Substrate/Competitorn/a
Meas. Tech.ChEMBL_458934 (CHEMBL924953)
Ki 26±n/a nM
Citation Verma, RPHansch, C Matrix metalloproteinases (MMPs): chemical-biological functions and (Q)SARs. Bioorg Med Chem15:2223-68 (2007) 
 
Matrix metalloproteinase-14
Name:Matrix metalloproteinase-14
Type:Protein
Mol. Mass.:65900.19
Organism:Homo sapiens (Human)
Description:P50281
Residue:582
BDBM50423397
NameBDBM50423397
Synonyms:CHEMBL398271
TypeSmall organic molecule
Emp. Form.C24H31N4O4PS
Mol. Mass.502.566
SMILESCC(=N)P(O)(O)CC(CSCc1ccccc1)C(=O)NC(Cc1c[nH]c2ccccc12)C(N)=O