Reaction Details
TargetInterstitial collagenase
LigandBDBM50088118
Substrate/Competitorn/a
Meas. Tech.ChEMBL_458930 (CHEMBL924949)
IC50 3.0±n/a nM
Citation Verma, RPHansch, C Matrix metalloproteinases (MMPs): chemical-biological functions and (Q)SARs. Bioorg Med Chem15:2223-68 (2007) 
 
Interstitial collagenase
Name:Interstitial collagenase
Type:Enzyme
Mol. Mass.:54010.26
Organism:Homo sapiens (Human)
Description: P03956
Residue:469
BDBM50088118
NameBDBM50088118
Synonyms:2-(N-(4-nitrobenzyl)-2,3,4,5,6-pentafluorophenylsulfonamido)-N-hydroxyacetamide N-Hydroxy-2-[(4-nitro-benzyl)-pentafluorobenzenesulfonyl-amino]-acetamide
TypeSmall organic molecule
Emp. Form.C15H10F5N3O6S
Mol. Mass.455.313
SMILESONC(=O)CN(Cc1ccc(cc1)[N+]([O-])=O)S(=O)(=O)c1c(F)c(F)c(F)c(F)c1F