Reaction Details
TargetCollagenase 3
LigandBDBM50096472
Substrate/Competitorn/a
Meas. Tech.ChEMBL_458933 (CHEMBL924952)
IC50 1.000000±n/a nM
Citation Verma, RPHansch, C Matrix metalloproteinases (MMPs): chemical-biological functions and (Q)SARs. Bioorg Med Chem15:2223-68 (2007) 
 
Collagenase 3
Name:Collagenase 3
Type:Enzyme
Mol. Mass.:53808.06
Organism:Homo sapiens (Human)
Description:P45452
Residue:471
BDBM50096472
NameBDBM50096472
Synonyms:2-(N-benzyl-4-methoxyphenylsulfonamido)-N-hydroxy-3-(2-(hydroxyamino)-2-oxoethoxy)benzamide CHEMBL80272
TypeSmall organic molecule
Emp. Form.C23H23N3O8S
Mol. Mass.501.509
SMILESCOc1ccc(cc1)S(=O)(=O)N(Cc1ccccc1)c1c(OCC(=O)NO)cccc1C(=O)NO