Reaction Details
TargetStromelysin-1
LigandBDBM50285574
Substrate/Competitorn/a
Meas. Tech.ChEMBL_458939 (CHEMBL924958)
Ki 110±n/a nM
Citation Verma, RPHansch, C Matrix metalloproteinases (MMPs): chemical-biological functions and (Q)SARs. Bioorg Med Chem15:2223-68 (2007) 
 
Stromelysin-1
Name:Stromelysin-1
Type:Enzyme
Mol. Mass.:53973.13
Organism:Homo sapiens (Human)
Description: P08254
Residue:477
BDBM50285574
NameBDBM50285574
Synonyms:(R)-2-((S)-1-((S)-4-methyl-1-oxo-1-(phenylamino)pentan-2-ylamino)-1-oxo-4-p-tolylbutan-2-ylamino)propanoic acid CHEMBL310834
TypeSmall organic molecule
Emp. Form.C26H35N3O4
Mol. Mass.453.5738
SMILESCC(C)C[C@H](NC(=O)[C@H](CCc1ccc(C)cc1)N[C@H](C)C(O)=O)C(=O)Nc1ccccc1