Reaction Details
Target72 kDa type IV collagenase
LigandBDBM11342
Substrate/Competitorn/a
Meas. Tech.ChEMBL_458931 (CHEMBL924950)
Ki 2.4±n/a nM
Citation Verma, RPHansch, C Matrix metalloproteinases (MMPs): chemical-biological functions and (Q)SARs. Bioorg Med Chem15:2223-68 (2007) 
 
72 kDa type IV collagenase
Name:72 kDa type IV collagenase
Type:Enzyme
Mol. Mass.:73870.36
Organism:Homo sapiens (Human)
Description: P08253
Residue:660
BDBM11342
NameBDBM11342
Synonyms:2-[benzyl(1,1,2,2,3,3,4,4,4-nonafluorobutane)sulfonamido]-N-hydroxy-3-methylbutanamide | Hydroxamate 22
TypeSmall organic molecule
Emp. Form.C16H17F9N2O4S
Mol. Mass.504.368
SMILESCC(C)C(N(Cc1ccccc1)S(=O)(=O)C(F)(F)C(F)(F)C(F)(F)C(F)(F)F)C(=O)NO